Make error

[ 66%] Built target createRandomVMTest
[ 76%] Built target mix
[ 93%] Built target testeth
/home/t/cpp-ethereum/alethzero/MainWin.cpp: In member function ‘void Main::on_debugCurrent_triggered()’:
/home/t/cpp-ethereum/alethzero/MainWin.cpp:1585:43: error: no matching function for call to ‘dev::eth::Executive::Executive(dev::eth::State&, const dev::eth::CanonBlockChain&)’
Executive e(s, ethereum()->blockChain());
^
/home/t/cpp-ethereum/alethzero/MainWin.cpp:1585:43: note: candidates are:
In file included from /home/t/cpp-ethereum/alethzero/MainWin.h:37:0,
from /home/t/cpp-ethereum/alethzero/MainWin.cpp:64:
/home/t/cpp-ethereum/alethzero/../libethereum/Executive.h:66:2: note: dev::eth::Executive::Executive(dev::eth::State&, const dev::eth::BlockChain&, unsigned int)
Executive(State& _s, BlockChain const& _bc, unsigned _level);
^
/home/t/cpp-ethereum/alethzero/../libethereum/Executive.h:66:2: note: candidate expects 3 arguments, 2 provided
/home/t/cpp-ethereum/alethzero/../libethereum/Executive.h:64:2: note: dev::eth::Executive::Executive(dev::eth::State&, const LastHashes&, unsigned int)
Executive(State& _s, LastHashes const& _lh, unsigned _level): m_s(_s), m_lastHashes(_lh), m_depth(_level) {}
^
/home/t/cpp-ethereum/alethzero/../libethereum/Executive.h:64:2: note: candidate expects 3 arguments, 2 provided
make[2]: *** [alethzero/CMakeFiles/alethzero.dir/MainWin.cpp.o] Error 1
make[1]: *** [alethzero/CMakeFiles/alethzero.dir/all] Error 2
make: *** [all] Error 2
[email protected]:~/cpp-ethereum/build$
Sign In or Register to comment.